{"text_format":"1","workbook":"xlsx","n_sheets":19,"sheets":["Budget","Locations","Version","Calculations","Lookup","Alphabetical","All","Archive","Batteries","SolarPanels","Defaults","Compare","Saved","StationInfo","BatteryArchive","SolarArchive","Display","Print-1","Print-2"],"not_rendered":{"charts":8,"images":30,"macros":1,"external_links":0,"defined_names":40,"comments":0,"pivot_tables":0},"unopened":[],"bounds":{"document_bytes":16777216,"sheet_cells":100000,"rows_first":2000,"rows_last":500,"rows_between":2000,"halvings":0,"cell_chars":16384,"cell_head_chars":4096},"cells_cut":0,"cells_raw":0,"read":"whole","date_system":"1900"}

{"sheet":"Budget","index":0,"n_rows":112,"n_cols":20,"rows_kept":112,"cut":false,"hidden":false,"merged":[[91,1,91,2],[8,4,8,5],[8,9,8,10],[8,11,8,12],[17,12,17,13],[19,12,19,13]]}
[]
[null,null,null,null,null,null,null,"Power Budget Spreadsheet"]
[null,"Steps"]
[null,"1.Select loads (click Add/Delete/Edit/Archive to add devices, if needed)",null,null,null,null,null,"3.Enter Minimum Average Temperature",null,null,null,null,null,"5.Enter Sun Hours for area"]
[null,"2.Adjust Program Intervals (scan and communications intervals)",null,null,null,null,null,"4.Enter Desired Backup and Battery Size (auto selection optional)",null,null,null,null,null,"6.Size Solar panel (auto selection optional)"]
[]
[null,"LOADS"]
[null,"Select Devices"]
[null,null,null,null,"Program Interval",null,null,"Lowest AveTemp",null,"Storage Reserve",null,"Charging Source"]
[null,null,null,null,"Scan","Comms",null,"Min",null,"Battery","Desired","Equiv.","Solar"]
{"$rows_left_out":103}
{"sheet":"Locations","index":1,"n_rows":26,"n_cols":27,"rows_kept":26,"cut":false,"hidden":false,"merged":[]}
[null,"Peak Sun Hours",null,null,null,null,null,null,null,null,null,null,null,"Temperature",null,null,null,null,null,null,null,null,null,null,null,null,"Location Box Options"]
["Place","January","February","March","April","May","June","July","August ","September","October","November ","December","January","February","March","April","May","June","July","August ","September","October","November ","December",null,"Add New"]
["Atitlan Guatemala",5.31,5.76,6.07,6.03,5.55,5.31,5.55,5.28,4.7,4.8,5,5.12,22.3,23.4,24.3,24.8,24.2,23.6,23.6,23.6,23.1,22.9,22.8,22.3,null,"Edit"]
["Barrow, Alaska",0,0.21,1.34,3.41,5.51,6.96,6.13,3.7,1.89,0.53,0.02,0,-24.4,-24.1,-20.9,-13.1,-3.94,2.95,5.57,3.97,-0.45,-9.86,-19.7,-23.3,null,"Delete"]
["Cartagena, Colombia",5.8,6.25,6.5,6.26,5.64,5.67,5.85,5.85,5.28,4.88,4.93,5.22,26.81,27.43,27.74,26.8,26.46,26.65,26.51,26.42,26.07,25.93,25.99,25.98]
["CENT",0.95,1.6,2.44,3.55,4.53,5.5,6.52,5.42,3.92,2.2000000000000002,1.03,0.71,-1.03,-1.33,-0.83,0.23,3.69,6.41,10.53,10.46,8.5299999999999994,4.0599999999999996,1.43,-1.39]
["Columbus Ohio",1.81,2.54,3.45,4.59,5,5.83,5.76,5.09,4.38,3.26,2,1.56,-1.1399999999999999,0.71,4.79,11.2,16.8,21.7,23.6,22.7,19,13.1,6.97,0.87]
["Durango Colorado",2.71,3.48,4.67,5.54,6.65,7.45,6.71,5.87,5.26,4.04,2.89,2.4900000000000002,-7.07,-4.57,-0.32,4.55,10.199999999999999,15.5,18.100000000000001,16.399999999999999,12.2,5.72,-1.8,-6.81]
["Escalante Utah",2.72,3.54,4.91,6.02,6.91,7.46,6.57,5.8,5.22,4.09,3.04,2.5299999999999998,-2.4500000000000002,0.11,4.6100000000000003,9.51,15.2,21,24.2,22.7,17.7,10.4,2.13,-2.66]
["Goblin Valley Utah",2.64,3.57,5.03,6.09,6.82,7.06,6.44,5.6,5.01,3.94,2.97,2.46,-4.1100000000000003,-1.36,3.43,8.52,14.4,20.3,23.7,22,16.7,9.36,1,-4.13]
{"$rows_left_out":17}
{"sheet":"Version","index":2,"n_rows":2,"n_cols":8,"rows_kept":2,"cut":false,"hidden":false,"merged":[]}
[null,null,null,null,null,null,"PBFun","Do not delete the \"PBFun\" in the cell next to this.  It is used in the vba to make sure the vba only runs on the power budget spreadsheet."]
[null,null,null,"PB_EP_07-15-14_2013_v2"]

{"sheet":"Calculations","index":3,"n_rows":1619,"n_cols":29,"rows_kept":1619,"cut":false,"hidden":false,"merged":[[10,0,10,11],[11,7,11,10],[11,3,11,6]]}
[null,"AHr/day","mWatt Hours",null,null,null,null,null,null,null,"Instantaneous","Design Voltage",null,null,null,null,null,null,null,"Units per hour"]
["Useage",{"$f":"Defaults!L15","v":3.2311785311999999},{"$f":"K2*24","v":35677.596281999999},"mW",{"$f":"Budget!M19*L2","v":42.813115538399998},"Wh",null,null,null,null,{"$f":"L28*L2*1000","v":1486.56651175},13.25,null,1,"Hour/day at 1000 W/m2",null,null,null,null,"Converstion",null,60,null,"C0",0.81899999999999995]
["Production",{"$f":"Defaults!K19","v":1.7749999999999999},{"$f":"K3*24","v":23518.749999999996},"mW",null,null,null,null,null,null,{"$f":"Defaults!K21","v":979.94791666666652},"Charged Voltage",null,1000,"joules per second",null,null,null,"Time","To Hours",null,"Hours",null,"C1",1.0999999999999999E-2,"Y3*Y5",{"$f":"Y3*Y5","v":-1.5289999999999998E-2}]
["Net",{"$f":"B3-B2","v":-1.4561785312},null,null,{"$f":"B3/B2","v":0.54933516760548595},"Times more generated that used.",null,null,null,null,null,13.2,null,3600,"seconds",null,null,1,"Sec",3600,1,{"$f":"U4*T4/60","v":60},null,"C2",-7.6069999999999995E-5,"Y4*AA5",{"$f":"Y4*AA5","v":-1.4697484699999997E-4}]
[null,"Battery size",null,null,null,null,"Solar Panel",null,null,null,null,null,null,{"$f":"N2*N4*N3/1000000","v":3.6},"MJ/m2/day",null,null,2,"milliSec",3600000,1,null,null,"T",{"$f":"IF(Display!$B$5=1,$AC$224,P36)","v":-1.39},"Y52",{"$f":"Y5^2","v":1.9320999999999997}]
[null,{"$f":"Budget!J12","v":5},{"$f":"Budget!J14","v":400},null,{"$f":"D8/24","v":79.580922430015917},"days",{"$f":"Budget!M12","v":9},null,{"$f":"Budget!M13","v":"45 Watt"},{"$f":"VLOOKUP($G$6,FullSolarPanelListwNum,5)","v":2.5},{"$f":"Defaults!K21","v":979.94791666666652},"mW Generated",null,null,null,null,null,3,"microSec",3600000000,1,null,null,"CF(T)",{"$f":"Y2+Y3*Y5+Y4*Y5^2","v":0.80356302515299993},null,{"$f":"Y2+Y3*Y5+Y4*AA5","v":0.80356302515299993}]
[null,"Desired Reserve",null,"Calculate Reserve",null,"Multiple Batteries","Suns Hours (worst)",null,"Min Hrs needed",null,"Or this many panels",null,"Panel size needed",null,null,null,null,4,"Min",60,1,{"$f":"U7/T7","v":1.6666666666666666E-2},null,null,{"$f":"$Y$2+$Y$3*Y5+$Y$4*Y5^2","v":0.80356302515299993},null,{"$f":"Y2+AA3+AA4","v":0.80356302515299993}]
[null,{"$f":"Calculations!M37","v":720},"Hrs",{"$f":"Calculations!K88","v":1909.9421383203821},"Hrs",{"$f":"Defaults!L26","v":0.37697477088660586},{"$f":"IF(IF(Display!$B$5=1,$AB$224,Calculations!$R$35)=0,0.0001,IF(Display!$B$5=1,$AB$224,Calculations!$R$35))","v":0.71},"Hrs./day","per day",{"$f":"Defaults!L20","v":1.2924714124799999},{"$f":"LOOKUP($G$6,SolarPanels!A2:A101,SolarPanels!F2:F101)","v":1.8203822710985915},null,{"$f":"K8*Budget!M14","v":81.917202199436616},"watt",null,null,null,5,"5 Min",12,5,{"$f":"V2/U8","v":12}]
[null,null,null,null,null,null,null,null,null,null,null,null,null,null,null,null,null,6,"10 Min",6,10]
[2,null,null,null,null,null,null,null,null,null,null,null,null,null,null,null,null,7,"15 Min",4,15]
{"$rows_left_out":1610}
{"sheet":"Lookup","index":4,"n_rows":500,"n_cols":27,"rows_kept":500,"cut":false,"hidden":false,"merged":[]}
[1,"Device Name","Average Active Current (Amps)","Average Quiescent Current (Amps)","mS Active/Scan Interval","Seconds/Comm Interval","Duty Cycle",null,null,"Categories"]
[{"$f":"A1+1","v":2},null,null,null,null,null,null,null,null,"Dataloggers"]
[{"$f":"A2+1","v":3},"Dataloggers",0,0,0,0,0,null,null,"Sensors"]
[4,"--------------------------------",0,0,0,0,0,null,null,"Network Peripherals"]
[5,"CR1000",0.01,5.9999999999999995E-4,250,null,1,null,null,"Peripherals"]
[6,"CR10X",4.4999999999999998E-2,1E-3,45,null,1,null,null,"Communications"]
[7,"CR200X",3.0000000000000001E-3,2.0000000000000001E-4,250,null,1,null,null,"Cameras"]
[8,"CR206 1 Sec Radio",2.2000000000000001E-3,2.2000000000000001E-3,86400000,null,1,null,null,"Other"]
[9,"CR206X 8 Sec",3.0000000000000001E-3,4.4999999999999999E-4,150,null,1,null,null,"Batteries"]
[10,"CR206X Always on ",2.7E-2,2.7E-2,86400000000,null,1,null,null,"Solar Panels"]
{"$rows_left_out":491}
{"sheet":"Alphabetical","index":5,"n_rows":1001,"n_cols":16,"rows_kept":1001,"cut":false,"hidden":false,"merged":[]}
[null,"Device Name","Average Active Current (Amps)","Average Quiescent Current (Amps)","mS Active/Scan Interval","Seconds/Comm Interval","Duty Cycle"]
[1,null,null,null,null,null,null,null,"Leave this row blank!!!!"]
[{"$f":"A2+1","v":2},"014A",1.0000000000000001E-5,1.0000000000000001E-5,86400000000,null,1]
[3,"024A-L",2.5000000000000001E-4,2.5000000000000001E-4,86400000,null,1]
[4,"03001-L/03002-L",2.5000000000000001E-4,2.5000000000000001E-4,86400000,null,1]
[5,"034B-L",2.5000000000000001E-4,2.5000000000000001E-4,86400000,null,1]
[6,"05103-45-L Alpine",2.5000000000000001E-4,2.5000000000000001E-4,86400000,null,1]
[7,"05103-L",2.5000000000000001E-4,2.5000000000000001E-4,86400000,null,1]
[8,"05106-L",2.5000000000000001E-4,2.5000000000000001E-4,86400000,null,1]
[9,"05305-L",2.5000000000000001E-4,2.5000000000000001E-4,86400000,null,1]
{"$rows_left_out":992}
{"sheet":"All","index":6,"n_rows":1001,"n_cols":9,"rows_kept":1001,"cut":false,"hidden":false,"merged":[]}
[null,"Device Name","Average Active Current (Amps)","Average Quiescent Current (Amps)","mS Active/Scan Interval","Seconds/Comm Interval","Duty Cycle"]
[1,null,null,null,null,null,null,null,"Leave this row blank!!!!!"]
[{"$f":"A2+1","v":2},"014A",1.0000000000000001E-5,1.0000000000000001E-5,86400000000,null,1]
[{"$f":"A3+1","v":3},"024A-L",2.5000000000000001E-4,2.5000000000000001E-4,86400000,null,1]
[4,"03001-L/03002-L",2.5000000000000001E-4,2.5000000000000001E-4,86400000,null,1]
[5,"034A-L",2.5000000000000001E-4,2.5000000000000001E-4,86400000,null,1]
[6,"034B-L",2.5000000000000001E-4,2.5000000000000001E-4,86400000,null,1]
[7,"05103-45-L Alpine",2.5000000000000001E-4,2.5000000000000001E-4,86400000,null,1]
[8,"05103-L",2.5000000000000001E-4,2.5000000000000001E-4,86400000,null,1]
[9,"05106-L",2.5000000000000001E-4,2.5000000000000001E-4,86400000,null,1]
{"$rows_left_out":992}
{"sheet":"Archive","index":7,"n_rows":500,"n_cols":9,"rows_kept":500,"cut":false,"hidden":false,"merged":[]}
[1,"Device Name","Average Active Current (Amps)","Average Quiescent Current (Amps)","mS Active/Scan Interval","Seconds/Comm Interval","Duty Cycle"]
[{"$f":"A1+1","v":2},null,null,null,null,null,null,null,"Leave this row blank!!"]
[{"$f":"A2+1","v":3},"Dataloggers",1,1,1,1,0.01]
[4,"--------------------------------",0,0,0,0,0]
[5,"CR216",3.0000000000000001E-3,2.0000000000000001E-4,200,null,1]
[{"$f":"A5+1","v":6},"CR23X",7.0000000000000007E-2,1.4E-3,333,null,1]
[7,"CR23X Display",5.0000000000000001E-3,0,0,45,1]
[8,"CR23X Measure",7.0000000000000007E-2,2E-3,100,null,1]
[9,"CR23X Processing",4.4999999999999998E-2,2E-3,100,null,1]
[10,"CR510 (use CR10X)",1.5E-3,1.5E-3,86400000,null,1]
{"$rows_left_out":491}
{"sheet":"Batteries","index":8,"n_rows":101,"n_cols":15,"rows_kept":101,"cut":false,"hidden":false,"merged":[]}
[null,"Battery Name","Amp Hours"]
[1,"1250Ah",1250,null,null,"1500 Ah",1500]
[{"$f":"A2+1","v":2},"5x200 ah",1000,null,null,"800 Ah",800,null,null,null,null,null,null,"1500 Ah",1500]
[{"$f":"A3+1","v":3},"675 Ah",675,null,null,"675 Ah",675,null,null,null,null,null,null,"1250Ah",1250]
[4,"500 Ah",500,null,null,"500 Ah",500,null,null,null,null,null,null,"675 Ah",675]
[5,"400 Ah",400,null,null,"400 Ah",400,null,null,null,null,null,null,"500 Ah",500]
[6,"400ah",400,null,null,"300 Ah",300,null,null,null,null,null,null,"400 Ah",400]
[7,"BP84 * 4",336,null,null,"200 Ah",200,null,null,null,null,null,null,"300 Ah",300]
[8,"300 Ah",300,null,null,"175 Ah",175,null,null,null,null,null,null,"200 Ah",200]
[9,"200 Ah",200,null,null,"150 Ah",150,null,null,null,null,null,null,"175 Ah",175]
{"$rows_left_out":92}
{"sheet":"SolarPanels","index":9,"n_rows":101,"n_cols":18,"rows_kept":101,"cut":false,"hidden":false,"merged":[]}
[null,"solar panels","Watts","Volts","Amps","S.Panel need","Efficiency"]
[1,"Solar 1000 Watt",1000,18,55.56,{"$f":"Defaults!$L$19/SolarPanels!E2","v":8.1910649347488818E-2},0.98,null,"14014 AC",1.3,{"$f":"Defaults!$L$19/SolarPanels!J2","v":3.5007351367280601}]
[{"$f":"A2+1","v":2},"Solar 500",500,18,27.78,{"$f":"Defaults!$L$19/SolarPanels!E3","v":0.16382129869497764},0.95,null,"One Watt",5.8819999999999997E-2,{"$f":"Defaults!$L$19/SolarPanels!J3","v":77.370888775016638},null,null,"800Solar",{"$f":"800/17","v":47.058823529411768}]
[{"$f":"A3+1","v":3},"Solar 90 * 4",360,18,20,{"$f":"Defaults!$L$19/SolarPanels!E4","v":0.22754778388732394},0.9,null,"2000Solar",{"$f":"2000/17","v":117.64705882352941},{"$f":"Defaults!$L$19/SolarPanels!J4","v":3.8683123260845068E-2}]
[4,"Solar 300 watt",300,18,16.670000000000002,{"$f":"Defaults!$L$19/SolarPanels!E5","v":0.27300274011676534},0.85,null,"1000Solar",{"$f":"1000/17","v":58.823529411764703},{"$f":"Defaults!$L$19/SolarPanels!J5","v":7.7366246521690135E-2}]
[5,"2x140",280,18,15.56,{"$f":"Defaults!$L$19/SolarPanels!E6","v":0.29247787132046776},0.8,null,"800Solar",{"$f":"800/17","v":47.058823529411768},{"$f":"Defaults!$L$19/SolarPanels!J6","v":9.6707808152112662E-2}]
[6,"SP200",200,18,11.11,{"$f":"Defaults!$L$19/SolarPanels!E7","v":0.40962697369455253},0.75,null,"240 Solar",16.12,{"$f":"Defaults!$L$19/SolarPanels!J7","v":0.28231734973613387}]
[7,"SP90",86,18,4.8,{"$f":"Defaults!$L$19/SolarPanels!E8","v":0.94811576619718307},0.7,null,"235Solar",{"$f":"235/13.2","v":17.803030303030305},{"$f":"Defaults!$L$19/SolarPanels!J8","v":0.25562814870746176}]
[8,"SP50",50,18,2.78,{"$f":"Defaults!$L$19/SolarPanels!E9","v":1.6370344164555679},null,null,"170Solar",10,{"$f":"Defaults!$L$19/SolarPanels!J9","v":0.45509556777464788}]
[9,"45 Watt",45,18,2.5,{"$f":"Defaults!$L$19/SolarPanels!E10","v":1.8203822710985915},null,null,"140Solar",8.1999999999999993,{"$f":"Defaults!$L$19/SolarPanels!J10","v":0.55499459484713154}]
{"$rows_left_out":92}
{"sheet":"Defaults","index":10,"n_rows":26,"n_cols":13,"rows_kept":26,"cut":false,"hidden":false,"merged":[]}
[null,"Value","Units"]
["Device:","CR1000",null,null,null,null,null,null,null,"System Losses"]
["Scan Interval:",5,"Seconds"]
["Comm Interval:",12,"Hours","Previous:","Hours",null,null,null,null,5]
["Battery:","PS100",null,null,null,null,null,null,null,{"$f":"$B$10","v":0.8},null,null,{"$f":"LOOKUP(J4,SolarPanels!A2:A8,SolarPanels!G2:G8)","v":0.8}]
["Battery Backup:",14,"Days"]
["Min Ave Temperature:",0,"°C",null,null,null,null,null,null,"Battery Losses"]
["Equivalent Sun Hours:",3.5,"Hours"]
["Solar Panel:","SP10",null,null,null,null,null,null,null,5]
["System Losses:",0.8,null,null,null,null,null,null,null,{"$f":"$B$11","v":0.8},null,null,{"$f":"LOOKUP(J9,SolarPanels!A2:A8,SolarPanels!G2:G8)","v":0.8}]
{"$rows_left_out":17}
{"sheet":"Compare","index":11,"n_rows":10,"n_cols":12,"rows_kept":10,"cut":false,"hidden":false,"merged":[]}
[]
[]
[]
[]
["System Name","Devices","Scan Interval (Seconds)","Communications Interval (Hours)","Lowest Average Temperature (°C)","Battery","Desired Battery Backup (Days)","Estimated Battery Backup (Days)","Equivalent Sun Hours","Solar Panel","Daily Load          (Amp Hours)","Daily Solar          (Amp Hours)"]
["Uplo_Shelter_noCom","CR1000, 107-L, 107-L, SR50A-L SDI-12, NL115 Ethernet, NL115 Card, CS106 Active, CMP3, LT420 Analog Level Transmitter, CS450-L/451-L, XantrexC35",10,1,-3,"400 Ah",30,119.76710822536033,0.7,"45 Watt",2.1277468512,1.7749999999999999]
["Uplo_Shelter_wCom","CR1000, 107-L, 107-L, SR50A-L SDI-12, NL115 Ethernet, NL115 Card, CS106 Active, CMP3, LT420 Analog Level Transmitter, CS450-L/451-L, XantrexC35, Nano",10,1,-3,"400 Ah",30,36.886785729704634,0.7,"45 Watt",6.9085468511999997,1.7749999999999999]
["CENT_Shltr","CR1000, 107-L, 107-L, SR50A-L SDI-12, NL115 Ethernet, NL115 Card, CS106 Active, CMP3, LT420 Analog Level Transmitter, CS450-L/451-L, SunSaver20, XTend-NEMA, LT420 Analog Level Transmitter, SA_COM_Signal",10,1,-2,"400 Ah",30,48.791177543525997,0.7,"45 Watt",5.2702185311999994,1.7749999999999999]
["CENT_Twr","CR3000, Nano, CSAT3, XantrexC35, NL115 Ethernet, NL115 Card, 05103-L, 107-L, CS616-L Active, CS616-L Active, CS616-L Active, CS616-L Active, HMP50-L, HMP50-L",10,1,-2,"675 Ah",30,51.433230149055696,0.7,"SP200",8.4366475200000011,7.8880999999999988]
["VAN_twr","CR3000, Nano, CSAT3, XantrexC35, NL115 Ethernet, NL115 Card, 05103-L, SR50A-L SDI-12, CS616-L Active, CS616-L Active, CS616-L Active, CS616-L Active, CS450-L/451-L, CMP3",10,1,-2,"5x200 ah",30,73.049307015614417,0.85,"SP200",8.8075900800000024,9.5545999999999989]
{"$rows_left_out":1}
{"sheet":"Saved","index":12,"n_rows":20,"n_cols":12,"rows_kept":20,"cut":false,"hidden":false,"merged":[]}
[]
[]
[]
[]
["System Name","Devices","Scan Interval (Seconds)","Communications Interval (Hours)","Lowest Average Temperature (°C)","Battery","Desired Battery Backup (Days)","Estimated Battery Backup (Days)","Equivalent Sun Hours","Solar Panel","Daily Load          (Amp Hours)","Daily Solar          (Amp Hours)"]
["ASP-temp","43502-L Ventilator, SunSaver20",5,1,-2,"400 Ah",1,17.590451438692039,0.85,"SP90",14.6304,4.1280000000000001]
["CENT_Shltr","CR1000, 107-L, 107-L, SR50A-L SDI-12, NL115 Ethernet, NL115 Card, CS106 Active, CMP3, LT420 Analog Level Transmitter, CS450-L/451-L, SunSaver20, XTend-NEMA, LT420 Analog Level Transmitter, SA_COM_Signal",10,1,-2,"400 Ah",30,48.791177543525997,0.7,"45 Watt",5.2702185311999994,1.7749999999999999]
["CENT_Twr","CR3000, Nano, CSAT3, XantrexC35, NL115 Ethernet, NL115 Card, 05103-L, 107-L, CS616-L Active, CS616-L Active, CS616-L Active, CS616-L Active, HMP50-L, HMP50-L",10,1,-2,"675 Ah",30,51.433230149055696,0.7,"SP200",8.4366475200000011,7.8880999999999988]
["Good Reserve Time","CR1000, Load 1 Amp",5,1,-3,"400 Ah",14,17.48292049870075,2.5,"SP200",14.445215999999997,0.1]
["GRWS100-NoComms","CR1000, 05103-L, TE525WS-L, LI200X-L, HC2S3-L, CS106 Active",5,12,0,"PS100",14,47.693948903233839,3.5,"SP10",9.6163142400000012E-2,1.9949999999999999]
{"$rows_left_out":11}
{"sheet":"StationInfo","index":13,"n_rows":0,"n_cols":0,"rows_kept":0,"cut":false,"hidden":false,"merged":[]}

{"sheet":"BatteryArchive","index":14,"n_rows":501,"n_cols":1,"rows_kept":501,"cut":false,"hidden":false,"merged":[]}
[]
[1]
[{"$f":"A2+1","v":2}]
[{"$f":"A3+1","v":3}]
[4]
[5]
[{"$f":"A6+1","v":6}]
[7]
[8]
[9]
{"$rows_left_out":492}
{"sheet":"SolarArchive","index":15,"n_rows":0,"n_cols":0,"rows_kept":0,"cut":false,"hidden":false,"merged":[]}

{"sheet":"Display","index":16,"n_rows":34,"n_cols":3,"rows_kept":34,"cut":false,"hidden":false,"merged":[]}
[]
["Instructions",1]
["Storm Graph",1]
["Battery Detail",1]
["LocationGraph",1]
["Buttons",null,"Position"]
["Add, etc.",1,{"$f":"B7","v":1}]
["View Specs",1,{"$f":"IF(B8=1,SUM(B7:B8),0)","v":2}]
["Reset",1,{"$f":"IF(B9=1,SUM(B7:B9),0)","v":3}]
["Defaults",1,{"$f":"IF(B10=1,SUM(B7:B10),0)","v":4}]
{"$rows_left_out":25}
{"sheet":"Print-1","index":17,"n_rows":26,"n_cols":8,"rows_kept":26,"cut":false,"hidden":false,"merged":[[25,1,25,2],[11,6,15,8],[3,4,7,5],[4,7,7,8],[3,7,3,8],[17,1,17,2]]}
[]
[null,null,null,"Power Budget Spreadsheet"]
[]
["SiteName:",null,null,"Address:",null,null,"Prepared By:"]
["Company:",null,null,null,null,null,"Notes:"]
["Contact:"]
["Phone #"]
[]
[]
[]
{"$rows_left_out":17}
{"sheet":"Print-2","index":18,"n_rows":12,"n_cols":12,"rows_kept":12,"cut":false,"hidden":false,"merged":[[3,4,7,5],[3,7,3,8],[4,7,7,8]]}
[]
[null,null,"Power Budget Spreadsheet Comparison"]
[]
["SiteName:",null,null,"Address:",null,null,"Prepared By:"]
["Company:",null,null,null,null,null,"Notes:"]
["Contact:"]
["Phone #"]
[]
[]
["System Name","Devices","Scan Interval (Seconds)","Communications Interval (Hours)","Lowest Average Temperature (°C)","Battery","Desired Battery Backup (Days)","Estimated Battery Backup (Days)","Equivalent Sun Hours","Solar Panel","Daily Load          (Amp Hours)","Daily Solar          (Amp Hours)"]
{"$rows_left_out":2}